Nowe posty

xx Przydatne Linki (4)
Wczoraj o 14:13:00
xx Awstat (0)
2019-08-22, 14:55:15
xx SMB - Access denied z Windows (9)
2019-08-19, 11:27:24
xx Kali Linux - książka. (0)
2019-08-19, 00:20:25
xx Arch - startx dla uruchomienia GNOME powoduje wyłączenie komputera (6)
2019-08-18, 14:37:04
xx Nie moge urchmomic laptopa - grub rescue. (1)
2019-08-17, 18:24:00
xx Po aktualizacji zniknęły niektóre funkcje (45)
2019-08-14, 06:39:01
xx Operacje na bitach. (4)
2019-08-10, 21:44:36
xx Pblem z montowaniem dysku sieciowego (1)
2019-08-09, 23:36:45
xx [Promocja] Mój nowy kanał na YouTube o Linuksie po polsku. (0)
2019-08-07, 20:36:10

Pokaż wiadomości

Ta sekcja pozwala Ci zobaczyć wszystkie wiadomości wysłane przez tego użytkownika. Zwróć uwagę, że możesz widzieć tylko wiadomości wysłane w działach do których masz aktualnie dostęp.


Pokaż wątki -

Strony: [1]
1
Urządzenia sieciowe / Problem z RT2400 i slackware 12
« dnia: 2008-02-03, 13:56:06 »
Witam. Mam problem z zainstalowaniem sterów do rt2400. Gdy spisuje make to pojawia się:
 CC [M]  /usr/src/linux-2.6.21.5/rt2400-1.2.2-b3/Module/rtmp_main.o
/usr/src/linux-2.6.21.5/rt2400-1.2.2-b3/Module/rtmp_main.c:55: error: expected ')' before string constant
/usr/src/linux-2.6.21.5/rt2400-1.2.2-b3/Module/rtmp_main.c:59: error: expected ')' before string constant
/usr/src/linux-2.6.21.5/rt2400-1.2.2-b3/Module/rtmp_main.c: In function 'RT2400_probe':
/usr/src/linux-2.6.21.5/rt2400-1.2.2-b3/Module/rtmp_main.c:170: error: 'struct net_device' has no member named 'get_wireless_stats'
/usr/src/linux-2.6.21.5/rt2400-1.2.2-b3/Module/rtmp_main.c:190: warning: format '%lx' expects type 'long unsigned int', but argument 3 has type 'resource_size_t'
/usr/src/linux-2.6.21.5/rt2400-1.2.2-b3/Module/rtmp_main.c: In function 'RT2400_open':
/usr/src/linux-2.6.21.5/rt2400-1.2.2-b3/Module/rtmp_main.c:238: warning: passing argument 2 of 'request_irq' from incompatible pointer type
make[2]: *** [/usr/src/linux-2.6.21.5/rt2400-1.2.2-b3/Module/rtmp_main.o] Error 1
make[1]: *** [_module_/usr/src/linux-2.6.21.5/rt2400-1.2.2-b3/Module] Error 2
make[1]: Leaving directory `/usr/src/linux-2.6.21.5'
rt2400.ko failed to build!
make: *** [module] Error 1
Moj linux to slackware 12.0 kernel jego to:2.6.21.5

Nie wiem co robić:/ bo jak zainstalowałem sterowniki cvs to net bardzo wolno działa/. prawie że nie działa.

2
Inne / problem ze slackware 12.0 z dostępem:/
« dnia: 2008-02-02, 12:30:05 »
Witam ponownie:) Zainstalowałem sobie Linuxa Slackware 12.0 i jak chce wejśc na jakąś linuxową partycje lub na CD to pokazuje mi się:
A security policy in place prevents this sender from sending this message to this recipient, see message bus configuration file (rejected message had interface "org.freedesktop.Hal.Device.Volume" member "Mount" error name "(unset)" destination "org.freedesktop.Hal").
Nie wiem dlaczego? POmocy:)

3
Urządzenia sieciowe / RT2400 potrzebna pilna pomoc.
« dnia: 2008-01-30, 17:09:50 »
Witam. Mam problem z zainstalowaniem karty sieciowej na chipsecie Ralink RT2400. Mój linux to Slackware. Na starym jądrze wszystko instaluje sie gładko. Ale przy instalacji musiałem wybrac nowy bo na starym nie działał mi zestaw bezprzewodowy(klawiatura+mysz). Nowe jajko to 2.6.18. I jak wejde w mc do folderu ze strerami i wpisze make to pokazuje się:
make: *** /lib/modules/2.6.18/build: No such file or directory.  Stop.
rt2400.ko failed to build!
make: *** [module] Error

Sam troszke popatrzyłem i wywnioskowałem że w katalogu /lib/modules/ mam numery starego jądra a nie nowego i myśle że to przez to:/ co poradzić??

 A bardzo pilnie potrzebuje linuxa slackware. :(

4
Mam zainstalowanego Linuxa Slackware 11.0. Przy kompie mam zestaw bezprzewodowy(klawiatura+mysz) na USB. I gdy zainstalowałem linuxa to klawiatura działa bez zarzutu, tylko myszka źle działa. Porusza się tylko w pionie. A gdy przycisnę jakiś klawisz myszki to lekko porusza się w prawo:/ Co musze zrobić żeby to naprawić?? Mój zestaw to Tracer TRK-16

Strony: [1]