Nowe posty

Pokaż wiadomości

Ta sekcja pozwala Ci zobaczyć wszystkie wiadomości wysłane przez tego użytkownika. Zwróć uwagę, że możesz widzieć tylko wiadomości wysłane w działach do których masz aktualnie dostęp.


Pokaż wątki - jarek kawa

Strony: [1]
1
Humor, ciekawostki etc. / Ku przestrodze
« dnia: 2006-02-28, 20:14:51 »
Pierwsze:

Cześć tato, wróciłem!!!
Ojciec siedzący przed komputerem, nie odrywając wzroku od monitora pyta:
- A gdzieś ty był?!
- W wojsku tato...

Drugie:

W ZOO, przed klatką z małpami synek pyta się mamy:
- Mamusiu, dlaczego w tej klatce zamknęli informatyków?
- Jak to, informatyków? - pyta mama.
- No tak, jak nasz tatuś - nieogolone, brudne i mają odparzenia na du...


pozdrowienia dla wszystkich maniaków linuxa :)
...zwłaszcza tych już z odparzeniami :D

jarjar

2
Inne / Pare pytań na temat live CD
« dnia: 2006-08-03, 17:45:38 »
Debian, po dist-upgrade sarge->etch
Ten komunikat wywala mi po każdorazowym wydaniu polecenia apt-get.
Np.
:# apt-get check
Czytanie list pakietów... Gotowe
Budowanie drzewa zależności... Gotowe
W: Brak (lub zerowy) priorytet przypięcia
W: Brak (lub zerowy) priorytet przypięcia

Być może jest to jakiś prosty błąd, ale przejrzałem apt-howto i niczego nie doszukałem się na ten temat.
Bardzo proszę o wskazówki co to oznacza i co można z tym zrobić, bo nie wiem jak to ugryźć.


pozdrawiam
jarjar

3
Inne urządzenia / SUSE 10.1 problem z floppy
« dnia: 2006-06-17, 17:44:30 »
zaraz po instalacji systemu podstawowego, potem gruba komp sie restartuje (standardowo),
nastepnie w grubie odpalam nowo zainstaloweany system
laduje sie:

\\'Booting Ubuntu, kernel 2.6.15-23-server\\'

root (hd1,0)

Filesystem type is ext2fs, partition type 0x83
kernel /boot/vmlinuz-2.6.15-23-server root=/dev/hdd1 ro quiet splash

[Linux-bzImage, setup=0x1c00, size=0x6b75f]
initrd /boot/initrd.img-2.6.15-23-server
[Linux-initrd @ 0x9940000, 0x69f6b8 bytes]
savedefault
boot


... i zaraz po tym komunikacie restartuje

probowalem reinstalowac system i samego gruba, ale caly czas jest tak samo.

Jesli sa potrzebne jeszcze jakies informacje do rozwiazania problemu, to bardzo prosze o uwagi.

Bede wdzieczny za pomoc

jarjar

4
Instalacja / Mandriva 2006 Power Pack
« dnia: 2006-04-07, 00:00:29 »
Sarge 3.1 kernel

Dokładnie trudno mi sprecyzować  czego problem dotyczy.
czy jest on związany z acpi, kartą dźwiękową, czy z czymś innym.

Pojawiła mi się taka informacja:
codec_semaphore: semaphore is not ready [0x1][0x300304]
codec_write 1: semaphore is not ready for register 0x54

Stało się to gdy zawiesił mi się gnome, i po przejściu na konsolę tekstową wyrzuciło mi to pomnorzone kilkadziesiąt razy zamiast logowania (gdy skończyło wysypywać zalogowałem się normalnie i zrestartowałem)


Problem nie pojawiał się na KDE (w ogóle się nie zawieszało), natomiast gnome co jakiś czas wisi.


poza tym:
W /var/log/XFree86.0.log pojawiają się wpisy:
(WW) Open APM failed (/dev/apm_bios) (No such file or directory)

(WW) I810(0): Bad V_BIOS checksum

(WW) I810(0): Extended BIOS function 0x5f11 not supported


mój lsmod
:~$ lsmod
Module                  Size  Used by
i830                   78596  3
ds                     18756  2
ipv6                  264740  10
floppy                 61200  0
parport_pc             36900  0
parport                41800  1 parport_pc
rtc                    12760  0
pcspkr                  3592  0
snd_intel8x0m          20264  0
snd_intel8x0           36460  0
snd_ac97_codec         69988  2 snd_intel8x0m,snd_intel8x0
snd_pcm                98728  2 snd_intel8x0m,snd_intel8x0
snd_timer              25732  1 snd_pcm
snd_page_alloc         11752  3 snd_intel8x0m,snd_intel8x0,snd_pcm
gameport                4704  1 snd_intel8x0
snd_mpu401_uart         7968  1 snd_intel8x0
snd_rawmidi            25124  1 snd_mpu401_uart
snd_seq_device          8200  1 snd_rawmidi
snd                    57156  8 snd_intel8x0m,snd_intel8x0,snd_ac97_codec,snd_pcm,snd_timer,snd_mpu401_uart,snd_rawmidi,snd_seq_device
pci_hotplug            34640  0
intel_agp              22816  1
uhci_hcd               33136  0
usbcore               119012  3 uhci_hcd
i810_audio             37588  2
ac97_codec             18956  1 i810_audio
soundcore              10336  4 snd,i810_audio
3c59x                  39368  0
yenta_socket           21728  0
pcmcia_core            70868  2 ds,yenta_socket
agpgart                34664  4 intel_agp
capability              4520  0
commoncap               7232  1 capability
i8k                     6384  0
thermal                12656  0
fan                     3980  0
button                  6296  0
battery                 9388  0
ac                      4812  0
processor              17264  1 thermal
joydev                  9984  0
mousedev               10476  1
evdev                   9600  0
tsdev                   7392  0
psmouse                20360  0
ide_cd                 42656  0
cdrom                  40732  1 ide_cd
reiserfs              250992  3
ide_generic             1408  0
ide_disk               19296  5
piix                   13440  1
ide_core              139940  4 ide_cd,ide_generic,ide_disk,piix
unix                   28756  546
font                    8320  0
vesafb                  6656  0
cfbcopyarea             3872  1 vesafb
cfbimgblt               3040  1 vesafb
cfbfillrect             3776  1 vesafb


i lspci
:~$ lspci
0000:00:00.0 Host bridge: Intel Corp. 82830 830 Chipset Host Bridge (rev 04)
0000:00:02.0 VGA compatible controller: Intel Corp. 82830 CGC [Chipset Graphics Controller] (rev 04)
0000:00:02.1 Display controller: Intel Corp. 82830 CGC [Chipset Graphics Controller]
0000:00:1d.0 USB Controller: Intel Corp. 82801CA/CAM USB (Hub #1) (rev 02)
0000:00:1e.0 PCI bridge: Intel Corp. 82801 PCI Bridge (rev 42)
0000:00:1f.0 ISA bridge: Intel Corp. 82801CAM ISA Bridge (LPC) (rev 02)
0000:00:1f.1 IDE interface: Intel Corp. 82801CAM IDE U100 (rev 02)
0000:00:1f.5 Multimedia audio controller: Intel Corp. 82801CA/CAM AC\\'97 Audio Controller (rev 02)
0000:00:1f.6 Modem: Intel Corp. 82801CA/CAM AC\\'97 Modem Controller (rev 02)
0000:02:00.0 Ethernet controller: 3Com Corporation 3c905C-TX/TX-M [Tornado] (rev 78)
0000:02:01.0 CardBus bridge: Texas Instruments PCI1410 PC card Cardbus
Controller (rev 02)


Proszę o pomoc i pozdrawiam

jarjar

5
Pierwsze:

Cześć tato, wróciłem!!!
Ojciec siedzący przed komputerem, nie odrywając wzroku od monitora pyta:
- A gdzieś ty był?!
- W wojsku tato...

Drugie:

W ZOO, przed klatką z małpami synek pyta się mamy:
- Mamusiu, dlaczego w tej klatce zamknęli informatyków?
- Jak to, informatyków? - pyta mama.
- No tak, jak nasz tatuś - nieogolone, brudne i mają odparzenia na du...


pozdrowienia dla wszystkich maniaków linuxa :)
...zwłaszcza tych już z odparzeniami :D

jarjar

6
GNOME / Gnome a przeżroczystość
« dnia: 2006-02-21, 21:26:38 »
Witam :)
laptop Dell c400
Czy komuś udało się uruchomić pod linuxem mały przycisk z symbolem \\"i\\", znajdujący się obok przycisku on/off?

Póki co \\"leży\\" sobie odłogiem, a może jest sposób na jego wykorzystanie :)

pozdr

jarjar

7
Konfiguracja / Mandrake 10.1 problem z USB
« dnia: 2006-02-19, 20:34:25 »
Debian Sarge, Gnome, kernel 2.6.8.2-686

Przy starcie gnoma pojawił mi się taki błąd:
---------------------
Błąd aktywacji konfiguracji XKB.
Prawdopodobnie wewnętrzny błąd X serwera.

The Free86 Project, Inc
40300001
Używasz 4.3.0.
Znane są problemy ze skomplikowanymi konfiguracjami XKB.
Spróbuj użyć prostrzej konfiguracji lub weź świeższą wersję Xfree.
Jeżeli zgłaszasz tą sytuację jako błąd, załącz:
- Wynik polecenia:  xprop -root \\"grep XKB
- Wynik polecenia:
gconftool-2 -R /desktop/gnome/peripherals/keyboard/xkb
---------------

Wyniki tych dwóch poleceń wklejam poniżej, w kolejności j.w.:
do pierwszego
_XKB_RULES_NAMES_BACKUP(STRING) = \\"xfree86\\", \\"pc105\\", \\"pl\\", \\"pl\\", \\"\\"
_XKB_RULES_NAMES(STRING) = \\"xfree86\\", \\"pc105\\", \\"pl\\", \\"pl\\", \\"\\"


do drugiego:
 layouts = [pl  pl]
 model = pc105
 overrideSettings = false
 options = []
 update_handlers = []


Błąd pojawił się zaraz po instalacji, podczas pierwszego uruchomienia gnoma; za pierwszym razem okienko błędu otworzyło się chyba z dziesięć razy, potem już za każdym razem tylko raz - jeśli to coś znaczy...
ponadto gnome jest bardzo niestabilny - często się zawiesza.

Bardzo proszę o pomoc. Być może ktoś z Was spotkał się z tym błędem, lub wie jak go rozwiązać.
Jeśli nie, to cz wiecie jak moge przekonfigurować XKB?


Bardzo proszę o pomoc

pozdrawiam
jarjar

8
Konfiguracja / Knoppix Live cd bez dysku?
« dnia: 2006-02-16, 15:21:39 »
Debian Sarge z 2.6.8.2,
próbuję skompilować na 2.6.13.2.

zainstalowałem poprawnie wszystkie rzeczy potrzebne do kompilacji, i rozpocząłem procedurę zgodnie z zasadami :) np. tak jak tutaj: http://www.howtoforge.com/forums/showthread.php?t=21

po wywołaniu make-kpkg... (itd. jak na stronie w opisie) otrzymałem błędy podczas kompilacji modułów:

 

drivers/char/drm/gamma_drv.c:33:19: gamma.h: Nie ma takiego pliku ani katalogu
In file included from drivers/char/drm/gamma_drv.c:37:
drivers/char/drm/gamma_drv.h:66: error: `DRM\\' declared as function returning a function
drivers/char/drm/gamma_drv.h:66: warning: parameter names (without types) in function declaration
drivers/char/drm/gamma_drv.h:68: error: `DRM\\' declared as function returning a function
drivers/char/drm/gamma_drv.h:68: warning: parameter names (without types) in function declaration
drivers/char/drm/gamma_drv.h:70: error: `DRM\\' declared as function returning a function
drivers/char/drm/gamma_drv.h:70: warning: parameter names (without types) in function declaration
drivers/char/drm/gamma_drv.h:74: error: `DRM\\' declared as function returning a function
drivers/char/drm/gamma_drv.h:74: warning: parameter names (without types) in function declaration
drivers/char/drm/gamma_drv.h:76: error: `DRM\\' declared as function returning a function
drivers/char/drm/gamma_drv.h:76: warning: parameter names (without types) in function declaration
drivers/char/drm/gamma_drv.h:77: error: `DRM\\' declared as function returning a function
drivers/char/drm/gamma_drv.h:77: warning: parameter names (without types) in function declaration
drivers/char/drm/gamma_drv.h:78: error: `DRM\\' declared as function returning a function
drivers/char/drm/gamma_drv.h:78: warning: parameter names (without types) in function declaration
drivers/char/drm/gamma_drv.h:83: error: `DRM\\' declared as function returning a function
drivers/char/drm/gamma_drv.h:83: warning: parameter names (without types) in function declaration
drivers/char/drm/gamma_drv.h:84: error: `DRM\\' declared as function returning a function
drivers/char/drm/gamma_drv.h:84: warning: parameter names (without types) in function declaration
drivers/char/drm/gamma_drv.h:85: error: `DRM\\' declared as function returning a function
drivers/char/drm/gamma_drv.h:85: warning: parameter names (without types) in function declaration
drivers/char/drm/gamma_drv.h:86: error: `DRM\\' declared as function returning a function
drivers/char/drm/gamma_drv.h:86: warning: parameter names (without types) in function declaration
drivers/char/drm/gamma_drv.h:87: error: `DRM\\' declared as function returning a function
drivers/char/drm/gamma_drv.h:87: warning: parameter names (without types) in function declaration
drivers/char/drm/gamma_drv.h:88: error: `DRM\\' declared as function returning a function
drivers/char/drm/gamma_drv.h:88: warning: parameter names (without types) in function declaration
drivers/char/drm/gamma_drv.h:90: error: `DRM\\' declared as function returning a function
drivers/char/drm/gamma_drv.h:90: warning: parameter names (without types) in function declaration
drivers/char/drm/gamma_drv.h:91: error: `DRM\\' declared as function returning a function
drivers/char/drm/gamma_drv.h:91: warning: parameter names (without types) in function declaration
drivers/char/drm/gamma_drv.h:94: warning: parameter names (without types) in function declaration
drivers/char/drm/gamma_drv.h:94: error: conflicting types for `DRM\\'
drivers/char/drm/gamma_drv.h:91: error: previous declaration of `DRM\\'
drivers/char/drm/gamma_drv.c:39:22: drm_auth.h: Nie ma takiego pliku ani katalogu
drivers/char/drm/gamma_drv.c:40:28: drm_agpsupport.h: Nie ma takiego pliku ani katalogu
drivers/char/drm/gamma_drv.c:41:22: drm_bufs.h: Nie ma takiego pliku ani katalogu
In file included from drivers/char/drm/gamma_drv.c:42:
drivers/char/drm/gamma_context.h: In function `gamma_fops_read\\':
drivers/char/drm/gamma_context.h:48: error: structure has no member named `dev\\'
drivers/char/drm/gamma_context.h: At top level:
drivers/char/drm/gamma_context.h:96: error: `DRM\\' declared as function returning a function
drivers/char/drm/gamma_context.h:96: warning: function declaration isn\\'t a prototype
drivers/char/drm/gamma_context.h:96: error: conflicting types for `DRM\\'
drivers/char/drm/gamma_drv.h:94: error: previous declaration of `DRM\\'
drivers/char/drm/gamma_context.h: In function `DRM\\':
drivers/char/drm/gamma_context.h:97: error: `dev\\' undeclared (first use in thisfunction)
drivers/char/drm/gamma_context.h:97: error: (Each undeclared identifier is reported only once
drivers/char/drm/gamma_context.h:97: error: for each function it appears in.)
drivers/char/drm/gamma_context.h:98: error: `s\\' undeclared (first use in this function)
drivers/char/drm/gamma_context.h: In function `gamma_fops_poll\\':
drivers/char/drm/gamma_context.h:134: error: structure has no member named `dev\\'
drivers/char/drm/gamma_context.h: At top level:
drivers/char/drm/gamma_context.h:142: error: `DRM\\' declared as function returning a function
drivers/char/drm/gamma_context.h:142: warning: function declaration isn\\'t a prototype
drivers/char/drm/gamma_context.h:142: error: redefinition of `DRM\\'
drivers/char/drm/gamma_context.h:96: error: `DRM\\' previously defined here
drivers/char/drm/gamma_context.h: In function `DRM\\':
drivers/char/drm/gamma_context.h:146: error: `dev\\' undeclared (first use in this function)
drivers/char/drm/gamma_context.h:151: error: `old\\' undeclared (first use in this function)
drivers/char/drm/gamma_context.h:151: error: `new\\' undeclared (first use in this function)
drivers/char/drm/gamma_context.h:175: error: `write_string\\' undeclared (first use in this function)
drivers/char/drm/gamma_context.h:175: error: called object is not a function
drivers/char/drm/gamma_context.h: At top level:
drivers/char/drm/gamma_context.h:183: error: `DRM\\' declared as function returning a function
drivers/char/drm/gamma_context.h:183: warning: function declaration isn\\'t a prototype
drivers/char/drm/gamma_context.h:183: error: redefinition of `DRM\\'
drivers/char/drm/gamma_context.h:142: error: `DRM\\' previously defined here
drivers/char/drm/gamma_context.h: In function `DRM\\':
drivers/char/drm/gamma_context.h:184: error: `dev\\' undeclared (first use in this function)
drivers/char/drm/gamma_context.h:186: error: `new\\' undeclared (first use in this function)
drivers/char/drm/gamma_context.h:193: error: structure has no member named `next_buffer\\'
drivers/char/drm/gamma_context.h:193: error: structure has no member named `next_buffer\\'
drivers/char/drm/gamma_context.h:194: error: `lock_free\\' undeclared (first use in this function)
drivers/char/drm/gamma_context.h:195: error: called object is not a function
drivers/char/drm/gamma_context.h: At top level:
drivers/char/drm/gamma_context.h:207: error: `DRM\\' declared as function returning a function
drivers/char/drm/gamma_context.h:207: warning: function declaration isn\\'t a prototype
drivers/char/drm/gamma_context.h:207: error: redefinition of `DRM\\'
drivers/char/drm/gamma_context.h:183: error: `DRM\\' previously defined here
drivers/char/drm/gamma_context.h:207: warning: `DRM\\' was declared `extern\\' and later `static\\'
drivers/char/drm/gamma_context.h: In function `DRM\\':
drivers/char/drm/gamma_context.h:210: error: `q\\' undeclared (first use in this function)
drivers/char/drm/gamma_context.h:231: error: `ctx\\' undeclared (first use in this function)
drivers/char/drm/gamma_context.h:233: error: `waitlist_create\\' undeclared (first use in this function)
drivers/char/drm/gamma_context.h:233: error: `dev\\' undeclared (first use in this function)
drivers/char/drm/gamma_context.h:233: error: called object is not a function
drivers/char/drm/gamma_context.h: At top level:
drivers/char/drm/gamma_context.h:249: error: `DRM\\' declared as function returning a function
drivers/char/drm/gamma_context.h:249: warning: function declaration isn\\'t a prototype
drivers/char/drm/gamma_context.h:249: error: redefinition of `DRM\\'
drivers/char/drm/gamma_context.h:207: error: `DRM\\' previously defined here
drivers/char/drm/gamma_context.h:249: warning: `DRM\\' was declared `extern\\' and later `static\\'
drivers/char/drm/gamma_context.h: In function `DRM\\':
drivers/char/drm/gamma_context.h:255: error: `dev\\' undeclared (first use in this function)
drivers/char/drm/gamma_context.h:267: error: `alloc\\' undeclared (first use in this function)
drivers/char/drm/gamma_context.h:267: error: called object is not a function
drivers/char/drm/gamma_context.h:278: error: `realloc\\' undeclared (first use inthis function)
drivers/char/drm/gamma_context.h:281: error: called object is not a function
drivers/char/drm/gamma_context.h: At top level:
drivers/char/drm/gamma_context.h:297: error: `DRM\\' declared as function returning a function
drivers/char/drm/gamma_context.h:297: warning: function declaration isn\\'t a prototype
drivers/char/drm/gamma_context.h:297: error: redefinition of `DRM\\'
drivers/char/drm/gamma_context.h:249: error: `DRM\\' previously defined here
drivers/char/drm/gamma_context.h: In function `DRM\\':
drivers/char/drm/gamma_context.h:298: error: `arg\\' undeclared (first use in this function)
drivers/char/drm/gamma_context.h: At top level:
drivers/char/drm/gamma_context.h:324: error: `DRM\\' declared as function returning a function
drivers/char/drm/gamma_context.h:324: warning: function declaration isn\\'t a prototype
drivers/char/drm/gamma_context.h:324: error: redefinition of `DRM\\'
drivers/char/drm/gamma_context.h:297: error: `DRM\\' previously defined here
drivers/char/drm/gamma_context.h: In function `DRM\\':
drivers/char/drm/gamma_context.h:325: error: `filp\\' undeclared (first use in this function)
drivers/char/drm/gamma_context.h:326: error: structure has no member named `dev\\'
drivers/char/drm/gamma_context.h:328: error: `arg\\' undeclared (first use in this function)
drivers/char/drm/gamma_context.h:332: error: `alloc_queue\\' undeclared (first use in this function)
drivers/char/drm/gamma_context.h:332: error: called object is not a function
drivers/char/drm/gamma_context.h:334: error: `init_queue\\' undeclared (first usein this function)
drivers/char/drm/gamma_context.h:334: error: called object is not a function
drivers/char/drm/gamma_context.h:335: error: called object is not a function
drivers/char/drm/gamma_context.h:337: error: called object is not a function
drivers/char/drm/gamma_context.h: At top level:
drivers/char/drm/gamma_context.h:346: error: `DRM\\' declared as function returning a function
drivers/char/drm/gamma_context.h:346: warning: function declaration isn\\'t a prototype
drivers/char/drm/gamma_context.h:346: error: redefinition of `DRM\\'
drivers/char/drm/gamma_context.h:324: error: `DRM\\' previously defined here
drivers/char/drm/gamma_context.h: In function `DRM\\':
drivers/char/drm/gamma_context.h:347: error: `filp\\' undeclared (first use in this function)
drivers/char/drm/gamma_context.h:348: error: structure has no member named `dev\\'
drivers/char/drm/gamma_context.h:352: error: `arg\\' undeclared (first use in this function)
drivers/char/drm/gamma_context.h: At top level:
drivers/char/drm/gamma_context.h:380: error: `DRM\\' declared as function returning a function
drivers/char/drm/gamma_context.h:380: warning: function declaration isn\\'t a prototype
drivers/char/drm/gamma_context.h:380: error: redefinition of `DRM\\'
drivers/char/drm/gamma_context.h:346: error: `DRM\\' previously defined here
drivers/char/drm/gamma_context.h: In function `DRM\\':
drivers/char/drm/gamma_context.h:381: error: `filp\\' undeclared (first use in this function)
drivers/char/drm/gamma_context.h:382: error: structure has no member named `dev\\'
drivers/char/drm/gamma_context.h:383: error: `arg\\' undeclared (first use in this function)
drivers/char/drm/gamma_context.h: At top level:
drivers/char/drm/gamma_context.h:413: error: `DRM\\' declared as function returning a function
drivers/char/drm/gamma_context.h:413: warning: function declaration isn\\'t a prototype
drivers/char/drm/gamma_context.h:413: error: redefinition of `DRM\\'
drivers/char/drm/gamma_context.h:380: error: `DRM\\' previously defined here
drivers/char/drm/gamma_context.h: In function `DRM\\':
drivers/char/drm/gamma_context.h:414: error: `filp\\' undeclared (first use in this function)
drivers/char/drm/gamma_context.h:415: error: structure has no member named `dev\\'
drivers/char/drm/gamma_context.h:418: error: `arg\\' undeclared (first use in this function)
drivers/char/drm/gamma_context.h:421: error: `context_switch\\' undeclared (firstuse in this function)
drivers/char/drm/gamma_context.h:421: error: called object is not a function
drivers/char/drm/gamma_context.h: At top level:
drivers/char/drm/gamma_context.h:426: error: `DRM\\' declared as function returning a function
drivers/char/drm/gamma_context.h:426: warning: function declaration isn\\'t a prototype
drivers/char/drm/gamma_context.h:426: error: redefinition of `DRM\\'
drivers/char/drm/gamma_context.h:413: error: `DRM\\' previously defined here
drivers/char/drm/gamma_context.h: In function `DRM\\':
drivers/char/drm/gamma_context.h:427: error: `filp\\' undeclared (first use in this function)
drivers/char/drm/gamma_context.h:428: error: structure has no member named `dev\\'
drivers/char/drm/gamma_context.h:431: error: `arg\\' undeclared (first use in this function)
drivers/char/drm/gamma_context.h:434: error: `context_switch_complete\\' undeclared (first use in this function)
drivers/char/drm/gamma_context.h:434: error: called object is not a function
drivers/char/drm/gamma_context.h: At top level:
drivers/char/drm/gamma_context.h:441: error: `DRM\\' declared as function returning a function
drivers/char/drm/gamma_context.h:441: warning: function declaration isn\\'t a prototype
drivers/char/drm/gamma_context.h:441: error: redefinition of `DRM\\'
drivers/char/drm/gamma_context.h:426: error: `DRM\\' previously defined here
drivers/char/drm/gamma_context.h: In function `DRM\\':
drivers/char/drm/gamma_context.h:442: error: `filp\\' undeclared (first use in this function)
drivers/char/drm/gamma_context.h:443: error: structure has no member named `dev\\'
drivers/char/drm/gamma_context.h:448: error: `arg\\' undeclared (first use in this function)
drivers/char/drm/gamma_context.h:474: error: `waitlist_get\\' undeclared (first use in this function)
drivers/char/drm/gamma_context.h:474: error: called object is not a function
drivers/char/drm/gamma_context.h:475: error: `free_buffer\\' undeclared (first use in this function)
drivers/char/drm/gamma_context.h:475: error: called object is not a function
drivers/char/drm/gamma_drv.c:43:21: drm_dma.h: Nie ma takiego pliku ani katalogu
In file included from drivers/char/drm/gamma_drv.c:44:
drivers/char/drm/gamma_old_dma.h: At top level:
drivers/char/drm/gamma_old_dma.h:37: error: `DRM\\' declared as function returning a function
drivers/char/drm/gamma_old_dma.h:37: warning: function declaration isn\\'t a prototype
drivers/char/drm/gamma_old_dma.h:37: error: redefinition of `DRM\\'
drivers/char/drm/gamma_context.h:441: error: `DRM\\' previously defined here
drivers/char/drm/gamma_old_dma.h: In function `DRM\\':
drivers/char/drm/gamma_old_dma.h:38: error: `dev\\' undeclared (first use in thisfunction)
drivers/char/drm/gamma_old_dma.h:40: error: structure has no member named `next_buffer\\'
drivers/char/drm/gamma_old_dma.h:41: error: structure has no member named `next_queue\\'
drivers/char/drm/gamma_old_dma.h:41: error: structure has no member named `next_queue\\'
drivers/char/drm/gamma_old_dma.h:41: error: structure has no member named `next_queue\\'
drivers/char/drm/gamma_old_dma.h:41: error: structure has no member named `next_queue\\'
drivers/char/drm/gamma_old_dma.h:41: error: structure has no member named `next_queue\\'
drivers/char/drm/gamma_old_dma.h:41: error: structure has no member named `next_queue\\'
drivers/char/drm/gamma_old_dma.h:42: error: structure has no member named `next_queue\\'
drivers/char/drm/gamma_old_dma.h:44: error: structure has no member named `next_queue\\'
drivers/char/drm/gamma_old_dma.h: At top level:
drivers/char/drm/gamma_old_dma.h:48: error: `DRM\\' declared as function returning a function
drivers/char/drm/gamma_old_dma.h:48: warning: function declaration isn\\'t a prototype
drivers/char/drm/gamma_old_dma.h:48: error: redefinition of `DRM\\'
drivers/char/drm/gamma_old_dma.h:37: error: `DRM\\' previously defined here
drivers/char/drm/gamma_old_dma.h: In function `DRM\\':
drivers/char/drm/gamma_old_dma.h:53: error: `dev\\' undeclared (first use in thisfunction)
drivers/char/drm/gamma_old_dma.h:97: error: `wrapper\\' undeclared (first use in this function)
drivers/char/drm/gamma_old_dma.h: At top level:
drivers/char/drm/gamma_old_dma.h:116: error: `DRM\\' declared as function returning a function
drivers/char/drm/gamma_old_dma.h:116: warning: function declaration isn\\'t a prototype
drivers/char/drm/gamma_old_dma.h:116: error: redefinition of `DRM\\'
drivers/char/drm/gamma_old_dma.h:48: error: `DRM\\' previously defined here
drivers/char/drm/gamma_old_dma.h: In function `DRM\\':
drivers/char/drm/gamma_old_dma.h:117: error: `filp\\' undeclared (first use in this function)
drivers/char/drm/gamma_old_dma.h:118: error: structure has no member named `dev\\'
drivers/char/drm/gamma_old_dma.h:129: error: `d\\' undeclared (first use in this function)
drivers/char/drm/gamma_old_dma.h:173: error: `alloc\\' undeclared (first use in this function)
drivers/char/drm/gamma_old_dma.h:173: error: called object is not a function
drivers/char/drm/gamma_old_dma.h:222: error: `free_buffer\\' undeclared (first use in this function)
drivers/char/drm/gamma_old_dma.h:222: error: called object is not a function
drivers/char/drm/gamma_old_dma.h:224: error: `waitlist_put\\' undeclared (first use in this function)
drivers/char/drm/gamma_old_dma.h:224: error: called object is not a function
drivers/char/drm/gamma_old_dma.h:233: error: `free\\' undeclared (first use in this function)
drivers/char/drm/gamma_old_dma.h:233: error: called object is not a function
drivers/char/drm/gamma_old_dma.h: At top level:
drivers/char/drm/gamma_old_dma.h:240: error: `DRM\\' declared as function returning a function
drivers/char/drm/gamma_old_dma.h:240: warning: function declaration isn\\'t a prototype
drivers/char/drm/gamma_old_dma.h:240: error: redefinition of `DRM\\'
drivers/char/drm/gamma_old_dma.h:116: error: `DRM\\' previously defined here
drivers/char/drm/gamma_old_dma.h:240: warning: `DRM\\' was declared `extern\\' and later `static\\'
drivers/char/drm/gamma_old_dma.h: In function `DRM\\':
drivers/char/drm/gamma_old_dma.h:241: error: `filp\\' undeclared (first use in this function)
drivers/char/drm/gamma_old_dma.h:242: error: structure has no member named `dev\\'
drivers/char/drm/gamma_old_dma.h:247: error: `d\\' undeclared (first use in this function)
drivers/char/drm/gamma_old_dma.h:248: error: `freelist_get\\' undeclared (first use in this function)
drivers/char/drm/gamma_old_dma.h:248: error: `order\\' undeclared (first use in this function)
drivers/char/drm/gamma_old_dma.h:249: error: called object is not a function
drivers/char/drm/gamma_old_dma.h: At top level:
drivers/char/drm/gamma_old_dma.h:276: error: `DRM\\' declared as function returning a function
drivers/char/drm/gamma_old_dma.h:276: warning: function declaration isn\\'t a prototype
drivers/char/drm/gamma_old_dma.h:276: error: redefinition of `DRM\\'
drivers/char/drm/gamma_old_dma.h:240: error: `DRM\\' previously defined here
drivers/char/drm/gamma_old_dma.h: In function `DRM\\':
drivers/char/drm/gamma_old_dma.h:281: error: `dma\\' undeclared (first use in this function)
drivers/char/drm/gamma_old_dma.h:281: error: called object is not a function
drivers/char/drm/gamma_old_dma.h:284: error: `dma_get_buffers_of_order\\' undeclared (first use in this function)
drivers/char/drm/gamma_old_dma.h:284: error: `filp\\' undeclared (first use in this function)
drivers/char/drm/gamma_old_dma.h:284: error: called object is not a function
drivers/char/drm/gamma_old_dma.h:295: error: called object is not a function
drivers/char/drm/gamma_old_dma.h:308: error: called object is not a function
drivers/char/drm/gamma_drv.c:45:26: drm_drawable.h: Nie ma takiego pliku ani katalogu
drivers/char/drm/gamma_drv.c:46:21: drm_drv.h: Nie ma takiego pliku ani katalogu
drivers/char/drm/gamma_drv.c:48:22: drm_fops.h: Nie ma takiego pliku ani katalogu
drivers/char/drm/gamma_drv.c:49:22: drm_init.h: Nie ma takiego pliku ani katalogu
drivers/char/drm/gamma_drv.c:50:23: drm_ioctl.h: Nie ma takiego pliku ani katalogu
drivers/char/drm/gamma_drv.c:51:21: drm_irq.h: Nie ma takiego pliku ani katalogu
In file included from drivers/char/drm/gamma_drv.c:52:
drivers/char/drm/gamma_lists.h: At top level:
drivers/char/drm/gamma_lists.h:36: error: `DRM\\' declared as function returning a function
drivers/char/drm/gamma_lists.h:36: warning: function declaration isn\\'t a prototype
drivers/char/drm/gamma_lists.h:36: error: redefinition of `DRM\\'
drivers/char/drm/gamma_old_dma.h:276: error: `DRM\\' previously defined here
drivers/char/drm/gamma_lists.h: In function `DRM\\':
drivers/char/drm/gamma_lists.h:37: error: `bl\\' undeclared (first use in this function)
drivers/char/drm/gamma_lists.h:39: error: `alloc\\' undeclared (first use in thisfunction)
drivers/char/drm/gamma_lists.h:40: error: called object is not a function
drivers/char/drm/gamma_lists.h:44: error: `count\\' undeclared (first use in thisfunction)
drivers/char/drm/gamma_lists.h: At top level:
drivers/char/drm/gamma_lists.h:54: error: `DRM\\' declared as function returning a function
drivers/char/drm/gamma_lists.h:54: warning: function declaration isn\\'t a prototype
drivers/char/drm/gamma_lists.h:54: error: redefinition of `DRM\\'
drivers/char/drm/gamma_lists.h:36: error: `DRM\\' previously defined here
drivers/char/drm/gamma_lists.h: In function `DRM\\':
drivers/char/drm/gamma_lists.h:55: error: `bl\\' undeclared (first use in this function)
drivers/char/drm/gamma_lists.h:56: error: `free\\' undeclared (first use in this function)
drivers/char/drm/gamma_lists.h:58: error: called object is not a function
drivers/char/drm/gamma_lists.h: At top level:
drivers/char/drm/gamma_lists.h:68: error: `DRM\\' declared as function returning a function
drivers/char/drm/gamma_lists.h:68: warning: function declaration isn\\'t a prototype
drivers/char/drm/gamma_lists.h:68: error: redefinition of `DRM\\'
drivers/char/drm/gamma_lists.h:54: error: `DRM\\' previously defined here
drivers/char/drm/gamma_lists.h: In function `DRM\\':
drivers/char/drm/gamma_lists.h:72: error: `bl\\' undeclared (first use in this function)
drivers/char/drm/gamma_lists.h:74: error: `buf\\' undeclared (first use in this function)
drivers/char/drm/gamma_lists.h: At top level:
drivers/char/drm/gamma_lists.h:89: error: `DRM\\' declared as function returning a function
drivers/char/drm/gamma_lists.h:89: warning: function declaration isn\\'t a prototype
drivers/char/drm/gamma_lists.h:89: error: redefinition of `DRM\\'
drivers/char/drm/gamma_lists.h:68: error: `DRM\\' previously defined here
drivers/char/drm/gamma_lists.h: In function `DRM\\':
drivers/char/drm/gamma_lists.h:93: error: `bl\\' undeclared (first use in this function)
drivers/char/drm/gamma_lists.h:97: warning: return makes integer from pointer without a cast
drivers/char/drm/gamma_lists.h:102: warning: return makes integer from pointer without a cast
drivers/char/drm/gamma_lists.h: At top level:
drivers/char/drm/gamma_lists.h:106: error: `DRM\\' declared as function returninga function
drivers/char/drm/gamma_lists.h:106: warning: function declaration isn\\'t a prototype
drivers/char/drm/gamma_lists.h:106: error: redefinition of `DRM\\'
drivers/char/drm/gamma_lists.h:89: error: `DRM\\' previously defined here
drivers/char/drm/gamma_lists.h: In function `DRM\\':
drivers/char/drm/gamma_lists.h:107: error: `bl\\' undeclared (first use in this function)
drivers/char/drm/gamma_lists.h: At top level:
drivers/char/drm/gamma_lists.h:119: error: `DRM\\' declared as function returninga function
drivers/char/drm/gamma_lists.h:119: warning: function declaration isn\\'t a prototype
drivers/char/drm/gamma_lists.h:119: error: redefinition of `DRM\\'
drivers/char/drm/gamma_lists.h:106: error: `DRM\\' previously defined here
drivers/char/drm/gamma_lists.h: In function `DRM\\':
drivers/char/drm/gamma_lists.h:120: error: `bl\\' undeclared (first use in this function)
drivers/char/drm/gamma_lists.h: At top level:
drivers/char/drm/gamma_lists.h:126: error: `DRM\\' declared as function returninga function
drivers/char/drm/gamma_lists.h:126: warning: function declaration isn\\'t a prototype
drivers/char/drm/gamma_lists.h:126: error: redefinition of `DRM\\'
drivers/char/drm/gamma_lists.h:119: error: `DRM\\' previously defined here
drivers/char/drm/gamma_lists.h: In function `DRM\\':
drivers/char/drm/gamma_lists.h:127: error: `dev\\' undeclared (first use in this function)
drivers/char/drm/gamma_lists.h:134: error: `buf\\' undeclared (first use in this function)
drivers/char/drm/gamma_lists.h:138: error: `bl\\' undeclared (first use in this function)
drivers/char/drm/gamma_lists.h: At top level:
drivers/char/drm/gamma_lists.h:161: error: `DRM\\' declared as function returninga function
drivers/char/drm/gamma_lists.h:161: warning: function declaration isn\\'t a prototype
drivers/char/drm/gamma_lists.h:161: error: redefinition of `DRM\\'
drivers/char/drm/gamma_lists.h:126: error: `DRM\\' previously defined here
drivers/char/drm/gamma_lists.h:161: warning: `DRM\\' was declared `extern\\' and later `static\\'
drivers/char/drm/gamma_lists.h: In function `DRM\\':
drivers/char/drm/gamma_lists.h:164: error: `bl\\' undeclared (first use in this function)
drivers/char/drm/gamma_lists.h:164: warning: return makes integer from pointer without a cast
drivers/char/drm/gamma_lists.h:170: warning: return makes integer from pointer without a cast
drivers/char/drm/gamma_lists.h:184: warning: return makes integer from pointer without a cast
drivers/char/drm/gamma_lists.h: At top level:
drivers/char/drm/gamma_lists.h:188: error: `DRM\\' declared as function returninga function
drivers/char/drm/gamma_lists.h:188: warning: function declaration isn\\'t a prototype
drivers/char/drm/gamma_lists.h:188: error: redefinition of `DRM\\'
drivers/char/drm/gamma_lists.h:161: error: `DRM\\' previously defined here
drivers/char/drm/gamma_lists.h: In function `DRM\\':
drivers/char/drm/gamma_lists.h:192: error: `bl\\' undeclared (first use in this function)
drivers/char/drm/gamma_lists.h:192: warning: return makes integer from pointer without a cast
drivers/char/drm/gamma_lists.h:198: error: `block\\' undeclared (first use in this function)
drivers/char/drm/gamma_lists.h:203: error: `freelist_try\\' undeclared (first usein this function)
drivers/char/drm/gamma_lists.h:203: error: called object is not a function
drivers/char/drm/gamma_lists.h:210: warning: return makes integer from pointer without a cast
drivers/char/drm/gamma_lists.h:213: error: called object is not a function
drivers/char/drm/gamma_drv.c:53:22: drm_lock.h: Nie ma takiego pliku ani katalogu
In file included from drivers/char/drm/gamma_drv.c:54:
drivers/char/drm/gamma_lock.h: At top level:
drivers/char/drm/gamma_lock.h:36: error: `DRM\\' declared as function returning afunction
drivers/char/drm/gamma_lock.h:36: warning: function declaration isn\\'t a prototype
drivers/char/drm/gamma_lock.h:36: error: redefinition of `DRM\\'
drivers/char/drm/gamma_lists.h:188: error: `DRM\\' previously defined here
drivers/char/drm/gamma_lock.h:36: warning: `DRM\\' was declared `extern\\' and later `static\\'
drivers/char/drm/gamma_lock.h: In function `DRM\\':
drivers/char/drm/gamma_lock.h:39: error: `dev\\' undeclared (first use in this function)
drivers/char/drm/gamma_lock.h:39: error: `context\\' undeclared (first use in this function)
drivers/char/drm/gamma_lock.h: At top level:
drivers/char/drm/gamma_lock.h:69: error: `DRM\\' declared as function returning afunction
drivers/char/drm/gamma_lock.h:69: warning: function declaration isn\\'t a prototype
drivers/char/drm/gamma_lock.h:69: error: redefinition of `DRM\\'
drivers/char/drm/gamma_lock.h:36: error: `DRM\\' previously defined here
drivers/char/drm/gamma_lock.h:69: warning: `DRM\\' was declared `extern\\' and later `static\\'
drivers/char/drm/gamma_lock.h: In function `DRM\\':
drivers/char/drm/gamma_lock.h:70: error: `dev\\' undeclared (first use in this function)
drivers/char/drm/gamma_lock.h:70: error: `context\\' undeclared (first use in this function)
drivers/char/drm/gamma_lock.h: At top level:
drivers/char/drm/gamma_lock.h:87: error: `DRM\\' declared as function returning afunction
drivers/char/drm/gamma_lock.h:87: warning: function declaration isn\\'t a prototype
drivers/char/drm/gamma_lock.h:87: error: redefinition of `DRM\\'
drivers/char/drm/gamma_lock.h:69: error: `DRM\\' previously defined here
drivers/char/drm/gamma_lock.h: In function `DRM\\':
drivers/char/drm/gamma_lock.h:93: error: `flags\\' undeclared (first use in this function)
drivers/char/drm/gamma_lock.h:94: error: `flush_queue\\' undeclared (first use inthis function)
drivers/char/drm/gamma_lock.h:94: error: `dev\\' undeclared (first use in this function)
drivers/char/drm/gamma_lock.h:94: error: called object is not a function
drivers/char/drm/gamma_lock.h:95: error: `context\\' undeclared (first use in this function)
drivers/char/drm/gamma_lock.h:95: error: called object is not a function
drivers/char/drm/gamma_lock.h:99: error: called object is not a function
drivers/char/drm/gamma_lock.h: At top level:
drivers/char/drm/gamma_lock.h:106: error: `DRM\\' declared as function returning a function
drivers/char/drm/gamma_lock.h:106: warning: function declaration isn\\'t a prototype
drivers/char/drm/gamma_lock.h:106: error: redefinition of `DRM\\'
drivers/char/drm/gamma_lock.h:87: error: `DRM\\' previously defined here
drivers/char/drm/gamma_lock.h: In function `DRM\\':
drivers/char/drm/gamma_lock.h:112: error: `flags\\' undeclared (first use in thisfunction)
drivers/char/drm/gamma_lock.h:113: error: `flush_unblock_queue\\' undeclared (first use in this function)
drivers/char/drm/gamma_lock.h:113: error: `dev\\' undeclared (first use in this function)
drivers/char/drm/gamma_lock.h:113: error: called object is not a function
drivers/char/drm/gamma_lock.h:114: error: `context\\' undeclared (first use in this function)
drivers/char/drm/gamma_lock.h:114: error: called object is not a function
drivers/char/drm/gamma_lock.h:118: error: called object is not a function
drivers/char/drm/gamma_lock.h: At top level:
drivers/char/drm/gamma_lock.h:127: error: `DRM\\' declared as function returning a function
drivers/char/drm/gamma_lock.h:127: warning: function declaration isn\\'t a prototype
drivers/char/drm/gamma_lock.h:127: error: redefinition of `DRM\\'
drivers/char/drm/gamma_lock.h:106: error: `DRM\\' previously defined here
drivers/char/drm/gamma_lock.h: In function `DRM\\':
drivers/char/drm/gamma_lock.h:128: error: `filp\\' undeclared (first use in this function)
drivers/char/drm/gamma_lock.h:129: error: structure has no member named `dev\\'
drivers/char/drm/gamma_lock.h:135: error: `arg\\' undeclared (first use in this function)
drivers/char/drm/gamma_lock.h:137: error: `flush_block_and_flush\\' undeclared (first use in this function)
drivers/char/drm/gamma_lock.h:137: error: called object is not a function
drivers/char/drm/gamma_lock.h:138: error: `flush_unblock\\' undeclared (first usein this function)
drivers/char/drm/gamma_lock.h:138: error: called object is not a function
In file included from drivers/char/drm/gamma_drv.c:55:
drivers/char/drm/drm_memory.h: At top level:
drivers/char/drm/drm_memory.h:65: error: redefinition of `drm_lookup_map\\'
drivers/char/drm/drm_memory.h:65: error: `drm_lookup_map\\' previously defined here
drivers/char/drm/drm_memory.h:83: error: redefinition of `agp_remap\\'
drivers/char/drm/drm_memory.h:83: error: `agp_remap\\' previously defined here
drivers/char/drm/drm_memory.h:123: error: redefinition of `drm_follow_page\\'
drivers/char/drm/drm_memory.h:123: error: `drm_follow_page\\' previously defined here
drivers/char/drm/drm_memory.h:151: error: redefinition of `drm_ioremap\\'
drivers/char/drm/drm_memory.h:151: error: `drm_ioremap\\' previously defined here
drivers/char/drm/drm_memory.h:163: error: redefinition of `drm_ioremap_nocache\\'
drivers/char/drm/drm_memory.h:163: error: `drm_ioremap_nocache\\' previously defined here
drivers/char/drm/drm_memory.h:174: error: redefinition of `drm_ioremapfree\\'
drivers/char/drm/drm_memory.h:174: error: `drm_ioremapfree\\' previously defined here
drivers/char/drm/gamma_drv.c:56:22: drm_proc.h: Nie ma takiego pliku ani katalogu
drivers/char/drm/gamma_drv.c:57:20: drm_vm.h: Nie ma takiego pliku ani katalogu
drivers/char/drm/gamma_drv.c:58:22: drm_stub.h: Nie ma takiego pliku ani katalogu
drivers/char/drm/gamma_drv.c:59:25: drm_scatter.h: Nie ma takiego pliku ani katalogu
drivers/char/drm/gamma_lists.h:161: warning: `DRM\\' defined but not used
drivers/char/drm/gamma_lock.h:36: warning: `DRM\\' defined but not used
drivers/char/drm/gamma_lock.h:69: warning: `DRM\\' defined but not used
make[4]: *** [drivers/char/drm/gamma_drv.o] Bł±d 1
make[3]: *** [drivers/char/drm] Bł±d 2
make[2]: *** [drivers/char] Bł±d 2
make[1]: *** [drivers] Bł±d 2
make[1]: Leaving directory `/usr/src/linux-2.6.13.2\\'
make: *** [stamp-build] Bł±d 2

problem jest już od jakiegoś czasu i nie wiem jak sobie z nim poradzić.

Proszę o pomoc!

9
Sieć / problem long :)
« dnia: 2005-12-01, 13:07:26 »
Witam wszystkich.

Czy ktoś wie w jaki sposób zmienić format numeracji w przypisach dolnych?

Chodzi mi o to, by numeracja pokazywała się w indeksie górnym, a nie w wielkości takiej jak reszta tekstu przypisu dolnego.

Szukałem w opcjach stylów i formatów, a także w pomocy, ale nie udało mi się nic wykombinować.
Teoretycznie w opcjach formatów jest możliwość zmiany formatu numeracji (poprzez wybór w rozwijanym okienku), ale nie dawało to żadnych efektów.

Mam OO 2.0 (z ux.pl), ale problem już był wcześniej na mojej wersji 1.2 (z pakietów sarge\\'a). Co ciekawe porównywałem moje ustawienia z inną wersją OO gdzie numeracja domyślnie pokazywała się w indeksie górnym i nie było żadnych widocznych różnic.

bardzo proszę o pomoc, bo mój promotor nie odpuści mi tej numeracji ;)

pozdrawiam
jarjar

p.s. sorki że z łindołza... :(

10
Sieć / lan radiowy nie działa
« dnia: 2005-09-18, 20:43:19 »
Debian Sarge kernel 2.6.8
dell c400

Mam laptopa z klawiatura uk. czy jest mozliwosc ustawienia w linuxie polskich literek - np alt+a itp?

w Polsce uzywamy klawiatur o wzorze amerykanskim. gdybym wiec ustawil na moim laptopie klawiature polska, na przyciskach zrobilby mi sie \\"kogiel-mogiel\\".

Bede wdzieczny za pomoc
pozdr

jarek

11
Z gory prosze o wyrozumialosc, gdyz na forum pytania o pendrivy pojawialy sie juz wielokrotnie, ale nie znalazlem zadnej odpowiedzi pasujacej...

debian sarge, kernel 2.6.8
jadro w pelni obluguje urzadzenie usb:
#lsusb
Bus 001 Device 005: ID 0930:6533 Toshiba Corp. 512M USB Stick
Bus 001 Device 001: ID 0000:0000

ponad to sformatowalem go w systemie vfat.

jednak po probie montowania
mount -t vfat /dev/sda1 /mnt

wyskakuje blad:
mount: wrong fs type, bad option, bad superblock on /dev/sda1,
       missing codepage or other error
       In some cases useful info is found in syslog - try
       dmesg | tail  or so


w dmesg otrzymuje taki komunikat:

scsi3 : SCSI emulation for USB Mass Storage devices
  Vendor:           Model: USB Flash Memory  Rev: 1.04
  Type:   Direct-Access                      ANSI SCSI revision: 02
SCSI device sda: 1001472 512-byte hdwr sectors (513 MB)
sda: assuming Write Enabled
sda: assuming drive cache: write through
 /dev/scsi/host3/bus0/target0/lun0: [CUMANA/ADFS] p1<5>Attached scsi removabledisk sda at scsi3, channel 0, id 0, lun 0
USB Mass Storage device found at 5
FAT: invalid media value (0xb9)
VFS: Can\\'t find a valid FAT filesystem on dev sda1.

dlaczego nie moze znalezc FAT na pendrivie, skoro sformatowalem go w tym systemie?

bardzo prosze o odpowiedz, gdyz nie mam pojecia jak to rozwiazac, wszelkie pomysly juz sie skonczyly, a przeszukiwania forum i neta jak dotad nic mi nie pomogly.
nigdzie takiego bledu nie znalazlem.

pozdr

jarek

12
Inne / Ktora dystrybucja ?????
« dnia: 2005-09-12, 13:58:26 »
Debian kernel 2.6.12

zrobilem upgrade z neta pakietow, woody -> sarge

1.po wydaniu jakiegokolwiek polecenia dot. modulow, np \\'lsmod\\' wywala mi blad: QM_MODULES function not implemented.

co ciekawe przy kompilacji kernela na pewno zaznaczylem opcje dot, obslugi modulow.

gdzies w necie znalazlem ze po aktualizacji modutils problem powinien sie rozwiazac. ale mam najnowsza wersje tego pakietu i nie mam pomyslow co z tym zrobic.


2. mam Xfce 4.2, chcialem zainstalowac kilka wtyczek do panelu. po odpaleniu skryptu instalacyjnego nie moze znalezc zadnego kompilatora c++, mimo ze mam gcc (jest to wersja po upgradzie, wiec nowszej chyba nie ma)

3. czy ktos wie czy debian wydal dystrybucje na architekture i686? z tego co szukalem na debian.org wszystko jest na i386. wydaje mi sie nieprawdopodobne ze nie ma wersji na i686, ale nie moge znalezc!

4. zainstalowalem adobe acrobata, ale nie moge go uruchomic. nawet bedac root po probie otwarcia jakiegos *.pdf wyskakuje blad, ze nie mam uprawnien do pliku


pozdr i prosze o pomoc

jarjar - chyba przerzuce sie spowrotem na woodiego

p.s. sorki ze pisze z winy... jestem w pracy.

Strony: [1]