Nowe posty

xx Jak usunąć kilka dowiązań twardych jednym poleceniem. (3)
2019-06-14, 12:12:10
xx Skrypt sprawdzający miejsce na dysku (1)
2019-06-13, 13:55:00
xx Samba server (3)
2019-06-10, 17:01:44
xx Skrypt tworzący użytkownika (3)
2019-06-07, 17:11:55
xx Jaki serwis komp. we Wrocławiu (0)
2019-06-06, 12:39:23
xx serwer wydruku (1)
2019-06-04, 13:57:58
xx mod_security i roundcube (0)
2019-05-27, 14:27:03
xx Touchpad po pewnym losowym czasie przestaje reagować (33)
2019-05-27, 10:14:21
xx [ROZWIĄZANY] przygotowanie zeskanowanego pdf do OCR (6)
2019-05-24, 14:46:43
xx Przydatne Linki (1)
2019-05-23, 18:05:04

Autor Wątek: błąd objtool make  (Przeczytany 200 razy)

Offline Milczarskivon

  • Users
  • Nowy na forum
  • *
  • Wiadomości: 24
    • Zobacz profil
błąd objtool make
« dnia: 2019-05-07, 09:14:53 »
root@MilczarskiVon:/usr/src/linux-5.0.9# make -j3
  HOSTCC  scripts/kconfig/conf.o
  HOSTLD  scripts/kconfig/conf
scripts/kconfig/conf  --syncconfig Kconfig
  HOSTCC  arch/x86/tools/relocs_32.o
 

HOSTCC  arch/x86/tools/relocs_64.o
  HOSTCC  scripts/genksyms/genksyms.o
  YACC    scripts/genksyms/parse.tab.c
  HOSTCC  arch/x86/tools/relocs_common.o
  LEX     scripts/genksyms/lex.lex.c
  HOSTLD  arch/x86/tools/relocs
  YACC    scripts/genksyms/parse.tab.h
  HOSTCC  scripts/genksyms/parse.tab.o
  DESCEND  objtool
  HOSTCC  scripts/selinux/genheaders/genheaders
/bin/sh: 1: Syntax error: Unterminated quoted string
  HOSTCC  scripts/genksyms/lex.lex.o
/bin/sh: 1: Syntax error: Unterminated quoted string
  HOSTCC   /usr/src/linux-5.0.9/tools/objtool/fixdep.o
  HOSTCC  scripts/selinux/mdp/mdp
  HOSTLD   /usr/src/linux-5.0.9/tools/objtool/fixdep-in.o
  LINK     /usr/src/linux-5.0.9/tools/objtool/fixdep
  HOSTLD  scripts/genksyms/genksyms
/bin/sh: 1: Syntax error: "(" unexpected
/usr/src/linux-5.0.9/tools/build/Makefile.build:96: polecenia dla obiektu '/usr/src/linux-5.0.9/tools/objtool/arch/x86/decode.o' nie powiodły się
make[4]: *** [/usr/src/linux-5.0.9/tools/objtool/arch/x86/decode.o] Błąd 2
/usr/src/linux-5.0.9/tools/build/Makefile.build:139: polecenia dla obiektu 'arch/x86' nie powiodły się
make[3]: *** [arch/x86] Błąd 2
Makefile:49: polecenia dla obiektu '/usr/src/linux-5.0.9/tools/objtool/objtool-in.o' nie powiodły się
make[2]: *** [/usr/src/linux-5.0.9/tools/objtool/objtool-in.o] Błąd 2
make[2]: *** Oczekiwanie na niezakończone zadania....
  CC       /usr/src/linux-5.0.9/tools/objtool/exec-cmd.o
  HOSTCC  scripts/bin2c
  HOSTCC  scripts/kallsyms
  HOSTCC  scripts/conmakehash
  CC       /usr/src/linux-5.0.9/tools/objtool/help.o
  CC       /usr/src/linux-5.0.9/tools/objtool/pager.o
  HOSTCC  scripts/recordmcount
  CC       /usr/src/linux-5.0.9/tools/objtool/parse-options.o
  CC       /usr/src/linux-5.0.9/tools/objtool/run-command.o
  HOSTCC  scripts/sortextable
  CC       /usr/src/linux-5.0.9/tools/objtool/sigchain.o
  HOSTCC  scripts/asn1_compiler
  CC       /usr/src/linux-5.0.9/tools/objtool/subcmd-config.o
  LD       /usr/src/linux-5.0.9/tools/objtool/libsubcmd-in.o
  AR       /usr/src/linux-5.0.9/tools/objtool/libsubcmd.a
Makefile:65: polecenia dla obiektu 'objtool' nie powiodły się
make[1]: *** [objtool] Błąd 2
Makefile:1699: polecenia dla obiektu 'tools/objtool' nie powiodły się
make: *** [tools/objtool] Błąd 2
make: *** Oczekiwanie na niezakończone zadania....
  HOSTCC  scripts/extract-cert